Target
5-hydroxytryptamine receptor 2A
Ligand
BDBM50194751
Substrate
Meas. Tech.
ChEMBL_399258 (CHEMBL855891)
Ki
53±n/a nM
Citation
 McLean, THParrish, JCBraden, MRMarona-Lewicka, DGallardo-Godoy, ANichols, DE 1-Aminomethylbenzocycloalkanes: conformationally restricted hallucinogenic phenethylamine analogues as functionally selective 5-HT2A receptor agonists. J Med Chem 49:5794-803 (2006)  
Target
Name:
5-hydroxytryptamine receptor 2A
Synonyms:
5-HT-2 5-HT2A 5-hydroxytryptamine receptor 2A (5HT-2A) 5HT2A_HUMAN HTR2A | Serotonin receptor 2A
Type:
undefined
Mol. Mass.:
52607.65
Organism:
Homo sapiens (Human)
Description:
P28223
Residue:
471
  
Inhibitor
Name:
BDBM50194751
Synonyms:
C-(5-bromo-4,7-dimethoxyindan-1-yl)methylamine | CHEMBL424890
Type:
Small organic molecule
Emp. Form.:
C12H16BrNO2
Mol. Mass.:
286.165
SMILES:
COc1cc(Br)c(OC)c2CCC(CN)c12
: