Target
Glyoxalase I
Ligand
BDBM50195360
Substrate
Meas. Tech.
ChEMBL_424952 (CHEMBL911358)
Ki
2190±n/a nM
Citation
 More, SSVince, R A metabolically stable tight-binding transition-state inhibitor of glyoxalase-I. Bioorg Med Chem Lett 16:6039-42 (2006)  
Target
Name:
Glyoxalase I
Synonyms:
GLO1 Lactoylglutathione lyase
Type:
PROTEIN
Mol. Mass.:
37210.98
Organism:
Saccharomyces cerevisiae
Description:
ChEMBL_571116
Residue:
326
  
Inhibitor
Name:
BDBM50195360
Synonyms:
(2S)-2-amino-3-[({[(1R)-1-[({[(4-bromophenyl)(hydroxy)amino]carbonyl}thio)methyl]-2-(carboxyamino)-2-oxoethyl]amino}carbonyl)amino]propanoic acid CHEMBL221011
Type:
Small organic molecule
Emp. Form.:
C16H20BrN5O8S
Mol. Mass.:
522.328
SMILES:
N[C@@H](CNC(=O)N[C@@H](CSC(=O)N(O)c1ccc(Br)cc1)C(=O)NCC(O)=O)C(O)=O
: