Target
Diacylglycerol acyltransferase/mycolyltransferase Ag85C
Ligand
BDBM50148582
Substrate
Meas. Tech.
ChEMBL_431881 (CHEMBL915964)
IC50
25700±n/a nM
Citation
 Gobec, SPlantan, IMravljak, JSvajger, UWilson, RABesra, GSSoares, SLAppelberg, RKikelj, D Design, synthesis, biochemical evaluation and antimycobacterial action of phosphonate inhibitors of antigen 85C, a crucial enzyme involved in biosynthesis of the mycobacterial cell wall. Eur J Med Chem 42:54-63 (2007)  
Target
Name:
Diacylglycerol acyltransferase/mycolyltransferase Ag85C
Synonyms:
A85C_MYCTU fbpC | mpt45
Type:
PROTEIN
Mol. Mass.:
36770.32
Organism:
Mycobacterium tuberculosis
Description:
ChEMBL_431881
Residue:
340
  
Inhibitor
Name:
BDBM50148582
Synonyms:
2-(1,3-dioxo-1,3-dihydro-2H-isoindol-2-yl)-ethylethyl nonylphosphonate Nonyl-phosphonic acid 2-(1,3-dioxo-1,3-dihydro-isoindol-2-yl)-ethyl ester ethyl ester
Type:
Small organic molecule
Emp. Form.:
C21H32NO5P
Mol. Mass.:
409.4562
SMILES:
CCCCCCCCCP(=O)(OCC)OCCN1C(=O)c2ccccc2C1=O
: