Target
Diacylglycerol acyltransferase/mycolyltransferase Ag85C
Ligand
BDBM50148595
Substrate
Meas. Tech.
ChEMBL_431881 (CHEMBL915964)
IC50
471300±n/a nM
Citation
 Gobec, SPlantan, IMravljak, JSvajger, UWilson, RABesra, GSSoares, SLAppelberg, RKikelj, D Design, synthesis, biochemical evaluation and antimycobacterial action of phosphonate inhibitors of antigen 85C, a crucial enzyme involved in biosynthesis of the mycobacterial cell wall. Eur J Med Chem 42:54-63 (2007)  
Target
Name:
Diacylglycerol acyltransferase/mycolyltransferase Ag85C
Synonyms:
A85C_MYCTU fbpC | mpt45
Type:
PROTEIN
Mol. Mass.:
36770.32
Organism:
Mycobacterium tuberculosis
Description:
ChEMBL_431881
Residue:
340
  
Inhibitor
Name:
BDBM50148595
Synonyms:
CHEMBL119480 ethyl hydrogen nonylphosphonate
Type:
Small organic molecule
Emp. Form.:
C11H25O3P
Mol. Mass.:
236.2882
SMILES:
CCCCCCCCCP(O)(=O)OCC
: