Target
Alpha-2C adrenergic receptor
Ligand
BDBM50196136
Substrate
Meas. Tech.
ChEMBL_406590 (CHEMBL907694)
Ki
25±n/a nM
Citation
 Höglund, IPSilver, SEngström, MTSalo, HTauber, AKyyrönen, HKSaarenketo, PHoffrén, AMKokko, KPohjanoksa, KSallinen, JSavola, JMWurster, SKallatsa, OA Structure-activity relationship of quinoline derivatives as potent and selective alpha(2C)-adrenoceptor antagonists. J Med Chem 49:6351-63 (2006)  
Target
Name:
Alpha-2C adrenergic receptor
Synonyms:
ADA2C_HUMAN ADRA2L2 Adrenergic alpha2C Adrenergic receptor alpha Alpha-2 adrenergic receptor subtype C4 Alpha-2C adrenoreceptor | adrenergic, alpha-2C-, receptor [Homo sapiens]
Type:
Enzyme
Mol. Mass.:
49552.32
Organism:
Homo sapiens (Human)
Description:
P18825
Residue:
462
  
Inhibitor
Name:
BDBM50196136
Synonyms:
(3-ethyl-2-methylquinolin-4-yl)-[4-(4-methylpiperazin-1-yl)-phenyl]amine | CHEMBL425803
Type:
Small organic molecule
Emp. Form.:
C23H28N4
Mol. Mass.:
360.4952
SMILES:
CCc1c(C)nc2ccccc2c1Nc1ccc(cc1)N1CCN(C)CC1
: