Target
Alpha-2C adrenergic receptor
Ligand
BDBM50196141
Substrate
Meas. Tech.
ChEMBL_406590 (CHEMBL907694)
Ki
35±n/a nM
Citation
 Höglund, IPSilver, SEngström, MTSalo, HTauber, AKyyrönen, HKSaarenketo, PHoffrén, AMKokko, KPohjanoksa, KSallinen, JSavola, JMWurster, SKallatsa, OA Structure-activity relationship of quinoline derivatives as potent and selective alpha(2C)-adrenoceptor antagonists. J Med Chem 49:6351-63 (2006)  
Target
Name:
Alpha-2C adrenergic receptor
Synonyms:
ADA2C_HUMAN ADRA2L2 Adrenergic alpha2C Adrenergic receptor alpha Alpha-2 adrenergic receptor subtype C4 Alpha-2C adrenoreceptor | adrenergic, alpha-2C-, receptor [Homo sapiens]
Type:
Enzyme
Mol. Mass.:
49552.32
Organism:
Homo sapiens (Human)
Description:
P18825
Residue:
462
  
Inhibitor
Name:
BDBM50196141
Synonyms:
(2,3-dimethylquinolin-4-yl)-[4-(4-methylpiperazin-1-yl)phenyl] amine | CHEMBL267464
Type:
Small organic molecule
Emp. Form.:
C22H26N4
Mol. Mass.:
346.4686
SMILES:
CN1CCN(CC1)c1ccc(Nc2c(C)c(C)nc3ccccc23)cc1
: