Target
Adenosine receptor A3
Ligand
BDBM50196569
Substrate
Meas. Tech.
ChEMBL_440719 (CHEMBL889816)
Ki
54±n/a nM
Citation
 Elzein, EKalla, RLi, XPerry, TMarquart, TMicklatcher, MLi, YWu, YZeng, DZablocki, J N6-Cycloalkyl-2-substituted adenosine derivatives as selective, high affinity adenosine A1 receptor agonists. Bioorg Med Chem Lett 17:161-6 (2006)  
Target
Name:
Adenosine receptor A3
Synonyms:
A3 adenosine receptor (hA3) ADORA3 | Adenosine A3 receptor (A3AR)
Type:
G Protein-Coupled Receptor (GPCR)
Mol. Mass.:
36197.32
Organism:
Homo sapiens (Human)
Description:
P0DMS8
Residue:
318
  
Inhibitor
Name:
BDBM50196569
Synonyms:
CHEMBL232516 | N-benzyl-1-(9-((2R,3R,4S,5R)-3,4-dihydroxy-5-(hydroxymethyl)-tetrahydrofuran-2-yl)-6-((R)-tetrahydrofuran-2-ylamino)-9H-purin-2-yl)-1H-pyrazole-4-carboxamide
Type:
Small organic molecule
Emp. Form.:
C25H28N8O6
Mol. Mass.:
536.5398
SMILES:
OC[C@H]1O[C@H]([C@H](O)[C@@H]1O)n1cnc2c(N[C@H]3CCCO3)nc(nc12)-n1cc(cn1)C(=O)NCc1ccccc1
: