Target
Adenosine receptor A3
Ligand
BDBM50196571
Substrate
Meas. Tech.
ChEMBL_440719 (CHEMBL889816)
Ki
26±n/a nM
Citation
 Elzein, EKalla, RLi, XPerry, TMarquart, TMicklatcher, MLi, YWu, YZeng, DZablocki, J N6-Cycloalkyl-2-substituted adenosine derivatives as selective, high affinity adenosine A1 receptor agonists. Bioorg Med Chem Lett 17:161-6 (2006)  
Target
Name:
Adenosine receptor A3
Synonyms:
A3 adenosine receptor (hA3) ADORA3 | Adenosine A3 receptor (A3AR)
Type:
G Protein-Coupled Receptor (GPCR)
Mol. Mass.:
36197.32
Organism:
Homo sapiens (Human)
Description:
P0DMS8
Residue:
318
  
Inhibitor
Name:
BDBM50196571
Synonyms:
(2R,3S,4R,5R)-2-(hydroxymethyl)-5-(2-(4-(hydroxymethyl)-1H-pyrazol-1-yl)-6-(quinolin-2-ylamino)-9H-purin-9-yl)-tetrahydrofuran-3,4-diol | CHEMBL232096
Type:
Small organic molecule
Emp. Form.:
C23H22N8O5
Mol. Mass.:
490.4714
SMILES:
OC[C@H]1O[C@H]([C@H](O)[C@@H]1O)n1cnc2c(Nc3ccc4ccccc4n3)nc(nc12)-n1cc(CO)cn1
: