Target
11-beta-hydroxysteroid dehydrogenase 1
Ligand
BDBM50197412
Substrate
Meas. Tech.
ChEMBL_453205 (CHEMBL902359)
Ki
8±n/a nM
Citation
 Sorensen, BWinn, MRohde, JShuai, QWang, JFung, SMonzon, KChiou, WStolarik, DImade, HPan, LDeng, XChovan, LLongenecker, KJudge, RQin, WBrune, MCamp, HFrevert, EUJacobson, PLink, JT Adamantane sulfone and sulfonamide 11-beta-HSD1 Inhibitors. Bioorg Med Chem Lett 17:527-32 (2007)  
Target
Name:
11-beta-hydroxysteroid dehydrogenase 1
Synonyms:
11-DH 11-beta-Hydroxysteroid Dehydrogenase 1 (11-beta-HSD1) 11-beta-hydroxysteroid dehydrogenase 1 (11HSD1) Corticosteroid 11-beta-dehydrogenase isozyme 1 (11-beta-HSD-1) Corticosteroid 11-beta-dehydrogenase isozyme 1 (11beta-HSD1) HSD11 HSD11L | SDR26C1
Type:
Enzyme
Mol. Mass.:
32409.16
Organism:
Homo sapiens (Human)
Description:
P28845
Residue:
292
  
Inhibitor
Name:
BDBM50197412
Synonyms:
CHEMBL241711 | N-(5-carbamoylmethanesulfonyl-adamantan-2-yl)-2-(2-chloro-4-fluoro-phenoxy)-2-methyl-propionamide
Type:
Small organic molecule
Emp. Form.:
C22H28ClFN2O5S
Mol. Mass.:
486.985
SMILES:
CC(C)(Oc1ccc(F)cc1Cl)C(=O)N[C@H]1C2CC3CC1C[C@](C3)(C2)S(=O)(=O)CC(N)=O
: