Target
Adenosine receptor A1
Ligand
BDBM50199298
Substrate
Meas. Tech.
ChEMBL_412199 (CHEMBL908894)
Ki
>100±n/a nM
Citation
 Vu, CBKiesman, WFConlon, PRLin, KCTam, MPetter, RCSmits, GLutterodt, FJin, XChen, LZhang, J Tricyclic imidazoline derivatives as potent and selective adenosine A1 receptor antagonists. J Med Chem 49:7132-9 (2006)  
Target
Name:
Adenosine receptor A1
Synonyms:
AA1R_RAT ADENOSINE A1 high Adenosine A1 receptor (A1) Adenosine receptors A1 | Adora1
Type:
Protein
Mol. Mass.:
36704.13
Organism:
Rattus norvegicus (rat)
Description:
Residue:
326
  
Inhibitor
Name:
BDBM50199298
Synonyms:
(S)-8-ethyl-2-(4-hydroxybicyclo[2.2.2]octan-1-yl)-4-propyl-7,8-dihydro-1H-imidazo[1,2-g]purin-5(4H)-one | CHEMBL218189
Type:
Small organic molecule
Emp. Form.:
C20H29N5O2
Mol. Mass.:
371.4766
SMILES:
CCCn1c2nc(nc2c2N[C@@H](CC)Cn2c1=O)C12CCC(O)(CC1)CC2
: