Target
Adenosine receptor A1
Ligand
BDBM50199301
Substrate
Meas. Tech.
ChEMBL_412202 (CHEMBL910041)
Ki
35±n/a nM
Citation
 Vu, CBKiesman, WFConlon, PRLin, KCTam, MPetter, RCSmits, GLutterodt, FJin, XChen, LZhang, J Tricyclic imidazoline derivatives as potent and selective adenosine A1 receptor antagonists. J Med Chem 49:7132-9 (2006)  
Target
Name:
Adenosine receptor A1
Synonyms:
A1 adenosine receptor (hA1) AA1R_HUMAN ADORA1 Adenosine A1-receptor Adenosine receptor A1 (hA1) | Adenosine transporter (AdT)
Type:
G Protein-Coupled Receptor (GPCR)
Mol. Mass.:
36520.92
Organism:
Homo sapiens (Human)
Description:
P30542
Residue:
326
  
Inhibitor
Name:
BDBM50199301
Synonyms:
(R)-3-(4-(8-ethyl-5-oxo-4-propyl-4,5,7,8-tetrahydro-1H-imidazo[1,2-g]purin-2-yl)bicyclo[2.2.2]octan-1-yl)propanoic acid | CHEMBL217268
Type:
Small organic molecule
Emp. Form.:
C23H33N5O3
Mol. Mass.:
427.5398
SMILES:
CCCn1c2nc(nc2c2N[C@H](CC)Cn2c1=O)C12CCC(CCC(O)=O)(CC1)CC2
: