Target
Peroxisome proliferator-activated receptor delta
Ligand
BDBM50199776
Substrate
Meas. Tech.
ChEMBL_453567 (CHEMBL885567)
IC50
3±n/a nM
Citation
 Gonzalez, ICLamar, JIradier, FXu, YWinneroski, LLYork, JYumibe, NZink, RMontrose-Rafizadeh, CEtgen, GJBroderick, CLOldham, BAMantlo, N Design and synthesis of a novel class of dual PPARgamma/delta agonists. Bioorg Med Chem Lett 17:1052-5 (2007)  
Target
Name:
Peroxisome proliferator-activated receptor delta
Synonyms:
NR1C2 NUCI Nuclear receptor subfamily 1 group C member 2 PPAR-beta PPARD Peroxisome proliferator-activated receptor Peroxisome proliferator-activated receptor delta
Type:
Enzyme
Mol. Mass.:
49910.45
Organism:
Homo sapiens (Human)
Description:
Q03181
Residue:
441
  
Inhibitor
Name:
BDBM50199776
Synonyms:
3-(2-ethyl-4-((R)-3-(4-ethyl-2-(pyridin-2-yl)phenoxy)butoxy)phenyl)propanoic acid | CHEMBL241479
Type:
Small organic molecule
Emp. Form.:
C28H33NO4
Mol. Mass.:
447.5659
SMILES:
CCc1ccc(O[C@H](C)CCOc2ccc(CCC(O)=O)c(CC)c2)c(c1)-c1ccccn1
: