Target
Peroxisome proliferator-activated receptor delta
Ligand
BDBM50199785
Substrate
Meas. Tech.
ChEMBL_453567 (CHEMBL885567)
IC50
5±n/a nM
Citation
 Gonzalez, ICLamar, JIradier, FXu, YWinneroski, LLYork, JYumibe, NZink, RMontrose-Rafizadeh, CEtgen, GJBroderick, CLOldham, BAMantlo, N Design and synthesis of a novel class of dual PPARgamma/delta agonists. Bioorg Med Chem Lett 17:1052-5 (2007)  
Target
Name:
Peroxisome proliferator-activated receptor delta
Synonyms:
NR1C2 NUCI Nuclear receptor subfamily 1 group C member 2 PPAR-beta PPARD Peroxisome proliferator-activated receptor Peroxisome proliferator-activated receptor delta
Type:
Enzyme
Mol. Mass.:
49910.45
Organism:
Homo sapiens (Human)
Description:
Q03181
Residue:
441
  
Inhibitor
Name:
BDBM50199785
Synonyms:
(R)-3-(4-(3-(4-ethyl-2-(pyridin-4-yl)phenoxy)butoxy)-2-methylphenyl)propanoic acid | CHEMBL391283
Type:
Small organic molecule
Emp. Form.:
C27H31NO4
Mol. Mass.:
433.5393
SMILES:
CCc1ccc(O[C@H](C)CCOc2ccc(CCC(O)=O)c(C)c2)c(c1)-c1ccncc1
: