Target
Adenosine receptor A3
Ligand
BDBM50199977
Substrate
Meas. Tech.
ChEMBL_422428 (CHEMBL909840)
Ki
1.8±n/a nM
Citation
 Cosyn, LPalaniappan, KKKim, SKDuong, HTGao, ZGJacobson, KAVan Calenbergh, S 2-triazole-substituted adenosines: a new class of selective A3 adenosine receptor agonists, partial agonists, and antagonists. J Med Chem 49:7373-83 (2006)  
Target
Name:
Adenosine receptor A3
Synonyms:
A3 adenosine receptor (hA3) ADORA3 | Adenosine A3 receptor (A3AR)
Type:
G Protein-Coupled Receptor (GPCR)
Mol. Mass.:
36197.32
Organism:
Homo sapiens (Human)
Description:
P0DMS8
Residue:
318
  
Inhibitor
Name:
BDBM50199977
Synonyms:
9-(5-ethylcarbamoyl-beta-D-ribofuranosyl)-N6-methyl-2-(4-pyridin-2-yl-1,2,3-triazol-1-yl)adenine | CHEMBL219910
Type:
Small organic molecule
Emp. Form.:
C20H22N10O4
Mol. Mass.:
466.4533
SMILES:
CCNC(=O)[C@H]1O[C@H]([C@H](O)[C@@H]1O)n1cnc2c(NC)nc(nc12)-n1cc(nn1)-c1ccccn1
: