Target
D(3) dopamine receptor
Ligand
BDBM50201338
Substrate
Meas. Tech.
ChEMBL_453886 (CHEMBL885888)
Ki
944±n/a nM
Citation
 Enzensperger, CKilian, SAckermann, MKoch, AKelch, KLehmann, J Dopamine/serotonin receptor ligands. Part 15: Oxygenation of the benz-indolo-azecine LE 300 leads to novel subnanomolar dopamine D1/D5 antagonists. Bioorg Med Chem Lett 17:1399-402 (2007)  
Target
Name:
D(3) dopamine receptor
Synonyms:
DOPAMINE D3 DRD3_HUMAN Dopamine D3 receptor (D3) Dopamine receptor Dopamine receptor D3
Type:
Mol. Mass.:
44243.43
Organism:
Homo sapiens (Human)
Description:
Residue:
400
  
Inhibitor
Name:
BDBM50201338
Synonyms:
7-methyl-6,7,8,9,14,15-hexahydro-5H-indolo[3,2-f][3]benzazecin-11-ol | CHEMBL245570
Type:
Small organic molecule
Emp. Form.:
C20H22N2O
Mol. Mass.:
306.4015
SMILES:
CN1CCc2c(Cc3ccccc3CC1)[nH]c1ccc(O)cc21
: