Target
B2 bradykinin receptor
Ligand
BDBM50202420
Substrate
Meas. Tech.
ChEMBL_423710 (CHEMBL913022)
IC50
>10000±n/a nM
Citation
 Kuduk, SDDi Marco, CNChang, RKWood, MRSchirripa, KMKim, JJWai, JMDiPardo, RMMurphy, KLRansom, RWHarrell, CMReiss, DRHolahan, MACook, JHess, JFSain, NUrban, MOTang, CPrueksaritanont, TPettibone, DJBock, MG Development of orally bioavailable and CNS penetrant biphenylaminocyclopropane carboxamide bradykinin B1 receptor antagonists. J Med Chem 50:272-82 (2007)  
Target
Name:
B2 bradykinin receptor
Synonyms:
B2 BRADYKININ B2R BK-2 receptor BKRB2_HUMAN | Bradykinin B2 receptor
Type:
Enzyme Catalytic Domain
Mol. Mass.:
44467.17
Organism:
Homo sapiens (Human)
Description:
B2 BRADYKININ BDKRB2 HUMAN::P30411
Residue:
391
  
Inhibitor
Name:
BDBM50202420
Synonyms:
CHEMBL219309 | methyl 3,3'-difluoro-4'-{[({1-[(2,2,3,3,3-pentafluoropropanoyl)amino]cyclopropyl}carbonyl)amino]methyl}-1,1'-biphenyl-2-carboxylate
Type:
Small organic molecule
Emp. Form.:
C22H17F7N2O4
Mol. Mass.:
506.3702
SMILES:
COC(=O)c1c(F)cccc1-c1ccc(CNC(=O)C2(CC2)NC(=O)C(F)(F)C(F)(F)F)c(F)c1
: