Target
Adenosine receptor A2a
Ligand
BDBM50202994
Substrate
Meas. Tech.
ChEMBL_454087 (CHEMBL903278)
Ki
0.5±n/a nM
Citation
 Neustadt, BRHao, JLindo, NGreenlee, WJStamford, AWTulshian, DOngini, EHunter, JMonopoli, ABertorelli, RFoster, CArik, LLachowicz, JNg, KFeng, KI Potent, selective, and orally active adenosine A2A receptor antagonists: arylpiperazine derivatives of pyrazolo[4,3-e]-1,2,4-triazolo[1,5-c]pyrimidines. Bioorg Med Chem Lett 17:1376-80 (2007)  
Target
Name:
Adenosine receptor A2a
Synonyms:
A2A adenosine receptor (hA2A) ADENOSINE A2 ADORA2 Adenosine A2A receptor (A2AAR)
Type:
G Protein-Coupled Receptor (GPCR)
Mol. Mass.:
44716.46
Organism:
Homo sapiens (Human)
Description:
P29274
Residue:
412
  
Inhibitor
Name:
BDBM50202994
Synonyms:
7-{2-[4-(4-chloro-phenyl)-piperazin-1-yl]-ethyl}-2-furan-2-yl-7H-pyrazolo[4,3-e][1,2,4]triazolo[1,5-c]pyrimidin-5-ylamine | CHEMBL240213
Type:
Small organic molecule
Emp. Form.:
C22H22ClN9O
Mol. Mass.:
463.923
SMILES:
Nc1nc2n(CCN3CCN(CC3)c3ccc(Cl)cc3)ncc2c2nc(nn12)-c1ccco1
: