Target
Prostaglandin G/H synthase 2
Ligand
BDBM50207448
Substrate
Meas. Tech.
ChEMBL_461151 (CHEMBL944174)
IC50
100±n/a nM
Citation
 Blobaum, ALMarnett, LJ Structural and functional basis of cyclooxygenase inhibition. J Med Chem 50:1425-41 (2007)  
Target
Name:
Prostaglandin G/H synthase 2
Synonyms:
COX2 Cyclooxygenase 2 (COX-2) Cyclooxygenase-2 (COX-2 AA) Cyclooxygenase-2 (COX-2) PGH2_HUMAN PHS II Prostaglandin E synthase/G/H synthase 2 Prostaglandin-endoperoxide synthase 2
Type:
Enzyme
Mol. Mass.:
69003.89
Organism:
Homo sapiens (Human)
Description:
Recombinant Cox-2 provided by Cayman (Cayman Chemical Co.,Ann Arbor, MI).
Residue:
604
  
Inhibitor
Name:
BDBM50207448
Synonyms:
2-(2',6'-diethoxy-2-fluoro-biphenyl4-yl)-propionic acid | CHEMBL257539
Type:
Small organic molecule
Emp. Form.:
C19H21FO4
Mol. Mass.:
332.366
SMILES:
CCOc1cccc(OCC)c1-c1ccc(cc1F)C(C)C(O)=O
: