Target
Muscarinic acetylcholine receptor M3
Ligand
BDBM50181089
Substrate
Meas. Tech.
ChEMBL_443515 (CHEMBL893770)
Ki
3.2±n/a nM
Citation
 Provins, LChristophe, BDanhaive, PDulieu, JGillard, MQuéré, LStebbins, K Dual M3 antagonists-PDE4 inhibitors. Part 2: Synthesis and SAR of 3-substituted azetidinyl derivatives. Bioorg Med Chem Lett 17:3077-80 (2007)  
Target
Name:
Muscarinic acetylcholine receptor M3
Synonyms:
ACM3_HUMAN Cholinergic, muscarinic M3 Muscarinic receptor M3 | RecName: Full=Muscarinic acetylcholine receptor M3
Type:
Enzyme
Mol. Mass.:
66151.03
Organism:
Homo sapiens (Human)
Description:
P20309
Residue:
590
  
Inhibitor
Name:
BDBM50181089
Synonyms:
6-(azepan-1-yl)-N,2-dicyclopropyl-5-methylpyrimidin-4-amine UCB-101333-3
Type:
Small organic molecule
Emp. Form.:
C17H26N4
Mol. Mass.:
286.4151
SMILES:
Cc1c(NC2CC2)nc(nc1N1CCCCCC1)C1CC1
: