Target
Cocaine esterase
Ligand
BDBM22722
Substrate
Meas. Tech.
ChEMBL_443527 (CHEMBL893784)
Ki
15.1±n/a nM
Citation
 Hicks, LDHyatt, JLMoak, TEdwards, CCTsurkan, LWierdl, MFerreira, AMWadkins, RMPotter, PM Analysis of the inhibition of mammalian carboxylesterases by novel fluorobenzoins and fluorobenzils. Bioorg Med Chem 15:3801-17 (2007)  
Target
Name:
Cocaine esterase
Synonyms:
CES2 EST2_HUMAN | ICE
Type:
PROTEIN
Mol. Mass.:
61801.08
Organism:
Homo sapiens (Human)
Description:
ChEMBL_1494240
Residue:
559
  
Inhibitor
Name:
BDBM22722
Synonyms:
1,2-diphenylethane-1,2-dione CHEMBL189886 | Diphenylethane-1,2-dione
Type:
Small organic molecule
Emp. Form.:
C14H10O2
Mol. Mass.:
210.228
SMILES:
O=C(C(=O)c1ccccc1)c1ccccc1
: