Target
Sodium-dependent serotonin transporter
Ligand
BDBM50209679
Substrate
Meas. Tech.
ChEMBL_443656 (CHEMBL893915)
Ki
5.10±n/a nM
Citation
 Zhou, DHatzenbuhler, NTGross, JLHarrison, BLEvrard, DAChlenov, MGolembieski, JHornby, GSchechter, LESmith, DLAndree, THStack, GP Novel pyridyl-fused 3-amino chroman derivatives with dual action at serotonin transporter and 5-HT1A receptor. Bioorg Med Chem Lett 17:3117-21 (2007)  
Target
Name:
Sodium-dependent serotonin transporter
Synonyms:
5-HT Transporter 5HT transporter Anandamid membrane transporter, AMT Monoamine transporters; Norepinephrine & serotonin Slc6a4 Sodium-dependent serotonin transporter (SERT) | imipramine receptor
Type:
Multi-pass membrane protein
Mol. Mass.:
70168.43
Organism:
Rattus norvegicus (rat)
Description:
P31652
Residue:
630
  
Inhibitor
Name:
BDBM50209679
Synonyms:
CHEMBL234853 | N-(3-(5-fluoro-1H-indol-3-yl)propyl)-2,3-dihydro-1H-pyrano[3,2-f]quinolin-2-amine
Type:
Small organic molecule
Emp. Form.:
C23H22FN3O
Mol. Mass.:
375.4387
SMILES:
Fc1ccc2[nH]cc(CCCNC3COc4ccc5ncccc5c4C3)c2c1
: