Target
5-hydroxytryptamine receptor 1A
Ligand
BDBM50209679
Substrate
Meas. Tech.
ChEMBL_443657 (CHEMBL893916)
Ki
313.8±n/a nM
Citation
 Zhou, DHatzenbuhler, NTGross, JLHarrison, BLEvrard, DAChlenov, MGolembieski, JHornby, GSchechter, LESmith, DLAndree, THStack, GP Novel pyridyl-fused 3-amino chroman derivatives with dual action at serotonin transporter and 5-HT1A receptor. Bioorg Med Chem Lett 17:3117-21 (2007)  
Target
Name:
5-hydroxytryptamine receptor 1A
Synonyms:
5-HT-1A 5-hydroxytryptamine receptor 1A (5-HT-1A) ADRB2RL1 Dopamine D2 receptor and serotonin 1a receptor HTR1A | Serotonin receptor 1A
Type:
Mol. Mass.:
46122.49
Organism:
Homo sapiens (Human)
Description:
Residue:
422
  
Inhibitor
Name:
BDBM50209679
Synonyms:
CHEMBL234853 | N-(3-(5-fluoro-1H-indol-3-yl)propyl)-2,3-dihydro-1H-pyrano[3,2-f]quinolin-2-amine
Type:
Small organic molecule
Emp. Form.:
C23H22FN3O
Mol. Mass.:
375.4387
SMILES:
Fc1ccc2[nH]cc(CCCNC3COc4ccc5ncccc5c4C3)c2c1
: