Target
B1 bradykinin receptor
Ligand
BDBM50209720
Substrate
Meas. Tech.
ChEMBL_434373 (CHEMBL919421)
Ki
151±n/a nM
Citation
 Biswas, KLi, AChen, JJD'Amico, DCFotsch, CHan, NHuman, JLiu, QNorman, MHRiahi, BYuan, CSuzuki, HMareska, DAZhan, JClarke, DEToro, AGroneberg, RDBurgess, LELester-Zeiner, DBiddlecome, GManning, BHArik, LDong, HHuang, MKamassah, ALoeloff, RSun, HHsieh, FYKumar, GNg, GYHungate, RWAskew, BCJohnson, E Potent nonpeptide antagonists of the bradykinin B1 receptor: structure-activity relationship studies with novel diaminochroman carboxamides. J Med Chem 50:2200-12 (2007)  
Target
Name:
B1 bradykinin receptor
Synonyms:
B1 BRADYKININ B1bkr BKRB1_RAT Bkr KB1 | Kinin B1 receptor
Type:
Enzyme Catalytic Domain
Mol. Mass.:
38389.97
Organism:
RAT
Description:
B1 BRADYKININ BDKRB1 RAT::P97583
Residue:
337
  
Inhibitor
Name:
BDBM50209720
Synonyms:
(R)-3-(4-fluorophenyl)-N-((R)-7-(pyrrolidin-1-ylmethyl)chroman-4-yl)-3-(3-(trifluoromethyl)phenylsulfonamido)-propanamide | CHEMBL227600
Type:
Small organic molecule
Emp. Form.:
C30H31F4N3O4S
Mol. Mass.:
605.643
SMILES:
Fc1ccc(cc1)[C@@H](CC(=O)N[C@@H]1CCOc2cc(CN3CCCC3)ccc12)NS(=O)(=O)c1cccc(c1)C(F)(F)F
: