Target
D(2) dopamine receptor
Ligand
BDBM50145347
Substrate
Meas. Tech.
ChEMBL_444110 (CHEMBL892236)
Ki
42±n/a nM
Citation
 Bueno, ABGilmore, JBoot, JBroadmore, RCooper, JFindlay, JHayhurst, LMarcos, AMontero, CMitchell, STimms, GTomlinson, RWallace, LWalton, L Naphthyl piperazines with dual activity as 5-HT1D antagonists and 5-HT reuptake inhibitors. Bioorg Med Chem Lett 17:3344-8 (2007)  
Target
Name:
D(2) dopamine receptor
Synonyms:
DOPAMINE D2 DOPAMINE D2 Short Dopamine D2 receptor Drd2
Type:
G Protein-Coupled Receptor (GPCR)
Mol. Mass.:
50931.60
Organism:
Rattus norvegicus (rat)
Description:
P61169
Residue:
444
  
Inhibitor
Name:
BDBM50145347
Synonyms:
1-(2-(4-(6-fluoro-1H-indol-3-yl)-5,6-dihydropyridin-1(2H)-yl)ethyl)-3,4-dihydro-1H-isochromene-6-carboxamide CHEMBL83617
Type:
Small organic molecule
Emp. Form.:
C25H26FN3O2
Mol. Mass.:
419.4912
SMILES:
NC(=O)c1ccc2C(CCN3CCC(=CC3)c3c[nH]c4cc(F)ccc34)OCCc2c1
: