Target
Glutamate receptor 4
Ligand
BDBM50166286
Substrate
Meas. Tech.
ChEMBL_435005 (CHEMBL920256)
Ki
0.044±n/a nM
Citation
 Vogensen, SBFrydenvang, KGreenwood, JRPostorino, GNielsen, BPickering, DSEbert, BBølcho, UEgebjerg, JGajhede, MKastrup, JSJohansen, TNClausen, RPKrogsgaard-Larsen, P A tetrazolyl-substituted subtype-selective AMPA receptor agonist. J Med Chem 50:2408-14 (2007)  
Target
Name:
Glutamate receptor 4
Synonyms:
GRIA4_RAT Glutamate receptor ionotropic, AMPA 4 Gria4
Type:
PROTEIN
Mol. Mass.:
100766.57
Organism:
Rattus norvegicus
Description:
ChEMBL_539474
Residue:
902
  
Inhibitor
Name:
BDBM50166286
Synonyms:
(RS)-2-amino-3-[3-hydroxy-5-(2-ethyl-2H-5-tetrazolyl)-4-isoxazolyl]propionic acid 2-amino-3-(5-(2-ethyl-2H-tetrazol-5-yl)-3-hydroxyisoxazol-4-yl)propanoic acid | CHEMBL370941
Type:
Small organic molecule
Emp. Form.:
C9H12N6O4
Mol. Mass.:
268.2294
SMILES:
CCn1nnc(n1)-c1o[nH]c(=O)c1CC(N)C(O)=O
: