Target
Estrogen receptor
Ligand
BDBM50212149
Substrate
Meas. Tech.
ChEMBL_438780 (CHEMBL889118)
Ki
0.21±n/a nM
Citation
 Richardson, TIFrank, SAWang, MClarke, CAJones, SAYing, BPKohlman, DTWallace, OBShepherd, TADally, RDPalkowitz, ADGeiser, AGBryant, HUHenck, JWCohen, IRRudmann, DGMcCann, DJCoutant, DEOldham, SWHummel, CWFong, KCHinklin, RLewis, GTian, HDodge, JA Structure-activity relationships of SERMs optimized for uterine antagonism and ovarian safety. Bioorg Med Chem Lett 17:3544-9 (2007)  
Target
Name:
Estrogen receptor
Synonyms:
ER ESR ESR1_HUMAN Estrogen receptor Estrogen receptor (ER-alpha) Estrogen receptor alpha (ER) Nuclear receptor subfamily 3 group A member 1
Type:
Protein
Mol. Mass.:
66230.44
Organism:
Homo sapiens (Human)
Description:
P03372
Residue:
595
  
Inhibitor
Name:
BDBM50212149
Synonyms:
6-(3-hydroxyphenyl)-5-(4-(2-(piperidin-1-yl)ethoxy)phenoxy)naphthalen-2-ol | CHEMBL390020
Type:
Small organic molecule
Emp. Form.:
C29H29NO4
Mol. Mass.:
455.5449
SMILES:
Oc1cccc(c1)-c1ccc2cc(O)ccc2c1Oc1ccc(OCCN2CCCCC2)cc1
: