Target
Beta-2 adrenergic receptor
Ligand
BDBM50213099
Substrate
Meas. Tech.
ChEMBL_436827 (CHEMBL905129)
Ki
480±n/a nM
Citation
 Jozwiak, KKhalid, CTanga, MJBerzetei-Gurske, IJimenez, LKozocas, JAWoo, AZhu, WXiao, RPAbernethy, DRWainer, IW Comparative molecular field analysis of the binding of the stereoisomers of fenoterol and fenoterol derivatives to the beta2 adrenergic receptor. J Med Chem 50:2903-15 (2007)  
Target
Name:
Beta-2 adrenergic receptor
Synonyms:
ADRB2 ADRB2_HUMAN Beta-2 adrenoceptor | Beta-2 adrenoreceptor
Type:
Mol. Mass.:
46461.69
Organism:
Homo sapiens (Human)
Description:
P07550
Residue:
413
  
Inhibitor
Name:
BDBM50213099
Synonyms:
(R,R)-(-)-1-p-methoxyphenyl-2-(beta-3',5'-dihydroxyphenyl-beta-oxy)ethylamino-propane US10617654, Compound (R,R)-2 US9492405, 32
Type:
Small organic molecule
Emp. Form.:
C18H23NO4
Mol. Mass.:
317.3795
SMILES:
COc1ccc(C[C@@H](C)NC[C@H](O)c2cc(O)cc(O)c2)cc1
: