Target
Small conductance calcium-activated potassium channel protein 3
Ligand
BDBM50215068
Substrate
Meas. Tech.
ChEMBL_437153 (CHEMBL906550)
IC50
360±n/a nM
Citation
 Fletcher, DIGanellin, CRPiergentili, ADunn, PMJenkinson, DH Synthesis and pharmacological testing of polyaminoquinolines as blockers of the apamin-sensitive Ca2+-activated K+ channel (SK(Ca)). Bioorg Med Chem 15:5457-79 (2007)  
Target
Name:
Small conductance calcium-activated potassium channel protein 3
Synonyms:
KCNN3_RAT SK3 | Small conductance calcium-activated potassium channel
Type:
PROTEIN
Mol. Mass.:
81476.29
Organism:
Rattus norvegicus
Description:
ChEMBL_494975
Residue:
732
  
Inhibitor
Name:
BDBM50215068
Synonyms:
CHEMBL229341 | N-[3-(4-quinolinylamino)-proyl]-3,5-di[3-(4-quinolinylamino)-propoxyl]-benzylamine
Type:
Small organic molecule
Emp. Form.:
C43H45N7O2
Mol. Mass.:
691.8631
SMILES:
C(CNCc1cc(OCCCNc2ccnc3ccccc23)cc(OCCCNc2ccnc3ccccc23)c1)CNc1ccnc2ccccc12
: