Target
Coagulation factor X
Ligand
BDBM50215424
Substrate
Meas. Tech.
ChEMBL_439442 (CHEMBL888562)
IC50
>30000±n/a nM
Citation
 Trujillo, JIHuang, HCNeumann, WLMahoney, MWLong, SHuang, WGarland, DJKusturin, CAbbas, ZSouth, MSReitz, DB Design, synthesis, and biological evaluation of pyrazinones containing novel P1 needles as inhibitors of TF/VIIa. Bioorg Med Chem Lett 17:4568-74 (2007)  
Target
Name:
Coagulation factor X
Synonyms:
Activated coagulation factor X (FXa) Coagulation factor X precursor F10 Factor X heavy chain Factor Xa Stuart-Prower factor
Type:
Enzyme
Mol. Mass.:
54726.60
Organism:
Homo sapiens (Human)
Description:
Residue:
488
  
Inhibitor
Name:
BDBM50215424
Synonyms:
CHEMBL243538 | N-((1-aminoisoquinolin-6-yl)methyl)-2-(6-(3-aminophenyl)-5-chloro-3-(cyclobutylamino)-2-oxopyrazin-1(2H)-yl)acetamide
Type:
Small organic molecule
Emp. Form.:
C26H26ClN7O2
Mol. Mass.:
503.983
SMILES:
Nc1cccc(c1)-c1c(Cl)nc(NC2CCC2)c(=O)n1CC(=O)NCc1ccc2c(N)nccc2c1
: