Target
Androgen receptor
Ligand
BDBM50215709
Substrate
Meas. Tech.
ChEMBL_447720 (CHEMBL896728)
Ki
0.25±n/a nM
Citation
 Manfredi, MCBi, YNirschl, AASutton, JCSeethala, RGolla, RBeehler, BCSleph, PGGrover, GJOstrowski, JHamann, LG Synthesis and SAR of tetrahydropyrrolo[1,2-b][1,2,5]thiadiazol-2(3H)-one 1,1-dioxide analogues as highly potent selective androgen receptor modulators. Bioorg Med Chem Lett 17:4487-90 (2007)  
Target
Name:
Androgen receptor
Synonyms:
ANDR_HUMAN Androgen Receptor Androgen receptor/Baculoviral IAP repeat-containing protein 2 Dihydrotestosterone receptor Nuclear receptor subfamily 3 group C member 4
Type:
Receptor
Mol. Mass.:
99185.27
Organism:
Homo sapiens (Human)
Description:
CHO cells were stably transfected with human AR gene.
Residue:
920
  
Inhibitor
Name:
BDBM50215709
Synonyms:
CHEMBL1170 Propionic acid 10,13-dimethyl-3-oxo-2,3,6,7,8,9,10,11,12,13,14,15,16,17-tetradecahydro-1H-cyclopenta[a]phenanthren-17-yl ester TESTOSTERONE PROPIONATE | testosteron propionate
Type:
Small organic molecule
Emp. Form.:
C22H32O3
Mol. Mass.:
344.4877
SMILES:
CCC(=O)O[C@H]1CC[C@H]2[C@@H]3CCC4=CC(=O)CC[C@]4(C)[C@H]3CC[C@]12C
: