Target
D(3) dopamine receptor
Ligand
BDBM50219947
Substrate
Meas. Tech.
ChEMBL_449063 (CHEMBL898268)
IC50
0.7±n/a nM
Citation
 Agai-Csongor, ENógrádi, KGalambos, JVágó, IBielik, AMagdó, IIgnácz-Szendrei, GKeseru, GMGreiner, ILaszlovszky, ISchmidt, EKiss, BSághy, KLaszy, JGyertyán, IZájer-Balázs, MGémesi, LDomány, G Novel sulfonamides having dual dopamine D2 and D3 receptor affinity show in vivo antipsychotic efficacy with beneficial cognitive and EPS profile. Bioorg Med Chem Lett 17:5340-4 (2007)  
Target
Name:
D(3) dopamine receptor
Synonyms:
DOPAMINE D3 Dopamine D3 receptor | Drd3
Type:
Protein
Mol. Mass.:
49540.58
Organism:
Rattus norvegicus (Rat)
Description:
P19020
Residue:
446
  
Inhibitor
Name:
BDBM50219947
Synonyms:
CHEMBL429093 | N-((1r,4r)-4-(2-(4-(3-cyanophenyl)piperazin-1-yl)ethyl)cyclohexyl)-3,4-dimethoxybenzenesulfonamide
Type:
Small organic molecule
Emp. Form.:
C27H36N4O4S
Mol. Mass.:
512.664
SMILES:
COc1ccc(cc1OC)S(=O)(=O)N[C@H]1CC[C@H](CCN2CCN(CC2)c2cccc(c2)C#N)CC1
: