Target
Metabotropic glutamate receptor 4
Ligand
BDBM50220011
Substrate
Meas. Tech.
ChEMBL_445954 (CHEMBL896247)
EC50
39±n/a nM
Citation
 Selvam, CGoudet, COueslati, NPin, JPAcher, FC L-(+)-2-Amino-4-thiophosphonobutyric acid (L-thioAP4), a new potent agonist of group III metabotropic glutamate receptors: increased distal acidity affords enhanced potency. J Med Chem 50:4656-64 (2007)  
Target
Name:
Metabotropic glutamate receptor 4
Synonyms:
GRM4_RAT Grm4 Metabotropic glutamate receptor 4 (mGlu4) mGlu4 metabotropic glutamate 4a
Type:
Enzyme
Mol. Mass.:
101849.79
Organism:
Rattus norvegicus (Rat)
Description:
P31423
Residue:
912
  
Inhibitor
Name:
BDBM50220011
Synonyms:
CHEMBL243925 | L-(+)-2-amino-4-thiophosphonobutyric acid
Type:
Small organic molecule
Emp. Form.:
C4H10NO4PS
Mol. Mass.:
199.165
SMILES:
N[C@@H](CCP(O)(O)=S)C(O)=O
: