Target
Amyloid-beta precursor protein
Ligand
BDBM50220289
Substrate
Meas. Tech.
ChEMBL_449193 (CHEMBL899458)
IC50
47±n/a nM
Citation
 Josien, HBara, TRajagopalan, MAsberom, TClader, JWFavreau, LGreenlee, WJHyde, LANomeir, AAParker, EMPissarnitski, DASong, LWong, GTZhang, LZhang, QZhao, Z Small conformationally restricted piperidine N-arylsulfonamides as orally active gamma-secretase inhibitors. Bioorg Med Chem Lett 17:5330-5 (2007)  
Target
Name:
Amyloid-beta precursor protein
Synonyms:
A4 ABPP AICD-50 AICD-59 AID(57) APP Alzheimer disease amyloid protein Amyloid beta Protein Amyloid beta protein Abeta(1-42) Amyloid intracellular domain 57 Amyloid protein (Abeta42b) Beta amyloid A4 protein Beta-APP42 Beta-amyloid protein 42 C83 CVAP Gamma Secretase Gamma-CTF(57) Gamma-secretase Gamma-secretase C-terminal fragment 57 P3(40) PN-II Protease nexin-II S-APP-beta Soluble APP-beta | beta-Amyloid Precursor Protein (APP)
Type:
Single-pass type I membrane protein
Mol. Mass.:
86890.41
Organism:
Homo sapiens (Human)
Description:
P05067
Residue:
770
  
Inhibitor
Name:
BDBM50220289
Synonyms:
(R)-1-((2R,6R)-1-(4-chlorophenylsulfonyl)-6-propylpiperidin-2-yl)cyclopropyl 3-hydroxypyrrolidine-1-carboxylate | CHEMBL240285
Type:
Small organic molecule
Emp. Form.:
C22H31ClN2O5S
Mol. Mass.:
471.01
SMILES:
CCC[C@@H]1CCC[C@@H](N1S(=O)(=O)c1ccc(Cl)cc1)C1(CC1)OC(=O)N1CC[C@@H](O)C1
: