Target
Beta-secretase 1
Ligand
BDBM50220319
Substrate
Meas. Tech.
ChEMBL_449199 (CHEMBL899464)
IC50
590±n/a nM
Citation
 Fobare, WFSolvibile, WRRobichaud, AJMalamas, MSManas, ETurner, JHu, YWagner, EChopra, RCowling, RJin, GBard, J Thiophene substituted acylguanidines as BACE1 inhibitors. Bioorg Med Chem Lett 17:5353-6 (2007)  
Target
Name:
Beta-secretase 1
Synonyms:
ASP2 Aspartyl protease 2 BACE1 Beta-secretase (BACE) Beta-secretase 1 (BACE 1) Beta-secretase 1 (BACE1) Beta-site amyloid precursor protein cleaving enzyme 1 Memapsin-2 beta-Secretase (BACE-1) | beta-Secretase (BACE1)
Type:
Protein
Mol. Mass.:
55755.10
Organism:
Homo sapiens (Human)
Description:
P56817
Residue:
501
  
Inhibitor
Name:
BDBM50220319
Synonyms:
2-(2-(2-chlorophenyl)-4-(4-propoxyphenyl)thiophen-3-yl)-N-(diaminomethylene)acetamide N-[amino(imino)methyl]-2-[2-(2-chlorophenyl)-4-(4-propoxyphenyl)-3-thienyl]acetamide
Type:
Small organic molecule
Emp. Form.:
C22H22ClN3O2S
Mol. Mass.:
427.947
SMILES:
CCCOc1ccc(cc1)-c1csc(c1CC(=O)NC(N)=N)-c1ccccc1Cl
: