Target
D(3) dopamine receptor
Ligand
BDBM50005118
Substrate
Meas. Tech.
ChEMBL_457318 (CHEMBL941851)
Ki
15±n/a nM
Citation
 Stark, DPiel, MHübner, HGmeiner, PGründer, GRösch, F In vitro affinities of various halogenated benzamide derivatives as potential radioligands for non-invasive quantification of D(2)-like dopamine receptors. Bioorg Med Chem 15:6819-29 (2007)  
Target
Name:
D(3) dopamine receptor
Synonyms:
DOPAMINE D3 DRD3_HUMAN Dopamine D3 receptor (D3) Dopamine receptor Dopamine receptor D3
Type:
Mol. Mass.:
44243.43
Organism:
Homo sapiens (Human)
Description:
Residue:
400
  
Inhibitor
Name:
BDBM50005118
Synonyms:
(S)-3,5-Dichloro-N-(1-ethyl-pyrrolidin-2-ylmethyl)-2-hydroxy-6-methoxy-benzamide (S)3,5-Dichloro-N-(1-ethyl-pyrrolidin-2-ylmethyl)-2-hydroxy-6-methoxy-benzamide 3,5-Dichloro-N-(1-ethyl-pyrrolidin-2-ylmethyl)-2-hydroxy-6-methoxy-benzamide 3,5-Dichloro-N-(1-ethyl-pyrrolidin-2-ylmethyl)-2-hydroxy-6-methoxy-benzamide(Raclopride) RACLOPRIDE | Raclopride;3,5-Dichloro-N-(1-ethyl-pyrrolidin-2-ylmethyl)-2-hydroxy-6-methoxy-benzamide
Type:
Small organic molecule
Emp. Form.:
C15H20Cl2N2O3
Mol. Mass.:
347.237
SMILES:
CCN1CCC[C@H]1CNC(=O)c1c(O)c(Cl)cc(Cl)c1OC
: