Target
Proto-oncogene tyrosine-protein kinase Src
Ligand
BDBM50221566
Substrate
Meas. Tech.
ChEMBL_457659 (CHEMBL923937)
Ki
1.3±n/a nM
Citation
 Cao, JFine, RGritzen, CHood, JKang, XKlebansky, BLohse, DMak, CCMcPherson, ANoronha, GPalanki, MSPathak, VPRenick, JSoll, RZeng, BZhu, H The design and preliminary structure-activity relationship studies of benzotriazines as potent inhibitors of Abl and Abl-T315I enzymes. Bioorg Med Chem Lett 17:5812-8 (2007)  
Target
Name:
Proto-oncogene tyrosine-protein kinase Src
Synonyms:
Calmodulin/Proto-oncogene tyrosine-protein kinase Src Proto-oncogene c-Src SRC SRC_HUMAN V-src sarcoma (Schmidt-Ruppin A-2) viral oncogene homolog (avian) p60-Src | pp60c-src
Type:
Protein
Mol. Mass.:
59838.60
Organism:
Homo sapiens (Human)
Description:
P12931
Residue:
536
  
Inhibitor
Name:
BDBM50221566
Synonyms:
4-chloro-3-(5-methyl-3-(4-(2-(pyrrolidin-1-yl)ethoxy)phenylamino)benzo[e][1,2,4]triazin-7-yl)phenol CHEMBL400402 US8481536, 597
Type:
Small organic molecule
Emp. Form.:
C26H26ClN5O2
Mol. Mass.:
475.97
SMILES:
Cc1cc(cc2nnc(Nc3ccc(OCCN4CCCC4)cc3)nc12)-c1cc(O)ccc1Cl
: