Target
Tyrosine-protein kinase ABL1
Ligand
BDBM50221565
Substrate
Meas. Tech.
ChEMBL_457651 (CHEMBL923928)
Ki
0.4±n/a nM
Citation
 Cao, JFine, RGritzen, CHood, JKang, XKlebansky, BLohse, DMak, CCMcPherson, ANoronha, GPalanki, MSPathak, VPRenick, JSoll, RZeng, BZhu, H The design and preliminary structure-activity relationship studies of benzotriazines as potent inhibitors of Abl and Abl-T315I enzymes. Bioorg Med Chem Lett 17:5812-8 (2007)  
Target
Name:
Tyrosine-protein kinase ABL1
Synonyms:
ABL ABL1_HUMAN JTK7 Proto-oncogene tyrosine-protein kinase ABL1 Tyrosine-protein kinase ABL V-abl Abelson murine leukemia viral oncogene homolog 1 p150 | tyrosine-protein kinase ABL1 isoform a
Type:
Enzyme
Mol. Mass.:
122897.30
Organism:
Homo sapiens (Human)
Description:
P00519
Residue:
1130
  
Inhibitor
Name:
BDBM50221565
Synonyms:
4-(7-(2-chloro-5-hydroxyphenyl)-5-methylbenzo[e][1,2,4]triazin-3-ylamino)-N-ethyl-N-(2-(pyrrolidin-1-yl)ethyl)benzenesulfonamide US8481536, 538
Type:
Small organic molecule
Emp. Form.:
C28H31ClN6O3S
Mol. Mass.:
567.102
SMILES:
CCN(CCN1CCCC1)S(=O)(=O)c1ccc(Nc2nnc3cc(cc(C)c3n2)-c2cc(O)ccc2Cl)cc1
: