Target
Tyrosine-protein kinase ABL1
Ligand
BDBM50221551
Substrate
Meas. Tech.
ChEMBL_457651 (CHEMBL923928)
Ki
4.4±n/a nM
Citation
 Cao, JFine, RGritzen, CHood, JKang, XKlebansky, BLohse, DMak, CCMcPherson, ANoronha, GPalanki, MSPathak, VPRenick, JSoll, RZeng, BZhu, H The design and preliminary structure-activity relationship studies of benzotriazines as potent inhibitors of Abl and Abl-T315I enzymes. Bioorg Med Chem Lett 17:5812-8 (2007)  
Target
Name:
Tyrosine-protein kinase ABL1
Synonyms:
ABL ABL1_HUMAN JTK7 Proto-oncogene tyrosine-protein kinase ABL1 Tyrosine-protein kinase ABL V-abl Abelson murine leukemia viral oncogene homolog 1 p150 | tyrosine-protein kinase ABL1 isoform a
Type:
Enzyme
Mol. Mass.:
122897.30
Organism:
Homo sapiens (Human)
Description:
P00519
Residue:
1130
  
Inhibitor
Name:
BDBM50221551
Synonyms:
4-chloro-3-(5-methyl-3-(4-(piperazin-1-ylsulfonyl)phenylamino)benzo[e][1,2,4]triazin-7-yl)phenol US8481536, 512
Type:
Small organic molecule
Emp. Form.:
C24H23ClN6O3S
Mol. Mass.:
510.996
SMILES:
Cc1cc(cc2nnc(Nc3ccc(cc3)S(=O)(=O)N3CCNCC3)nc12)-c1cc(O)ccc1Cl
: