Target
Aldo-keto reductase family 1 member B1
Ligand
BDBM50009767
Substrate
Meas. Tech.
ChEMBL_457959 (CHEMBL924228)
IC50
3.1±n/a nM
Citation
 Ferrari, AMDegliesposti, GSgobba, MRastelli, G Validation of an automated procedure for the prediction of relative free energies of binding on a set of aldose reductase inhibitors. Bioorg Med Chem 15:7865-77 (2007)  
Target
Name:
Aldo-keto reductase family 1 member B1
Synonyms:
AKR1B1 ALDR_HUMAN AR Aldose Reductase (ALR2) Aldose reductase (AR)
Type:
Protein
Mol. Mass.:
35855.50
Organism:
Homo sapiens (Human)
Description:
P15121. 4LAU; 2IKI; 4LB4; 2FZD; 2FZ8; 1US0
Residue:
316
  
Inhibitor
Name:
BDBM50009767
Synonyms:
2-(4-oxo-3-((6-(trifluoromethyl)benzo[d]thiazol-2-yl)methyl)-3,4-dihydrophthalazin-1-yl)acetic acid [4-Oxo-3-(6-trifluoromethyl-benzothiazol-2-ylmethyl)-3,4-dihydro-phthalazin-1-yl]-acetic acid
Type:
Small organic molecule
Emp. Form.:
C19H12F3N3O3S
Mol. Mass.:
419.377
SMILES:
OC(=O)Cc1nn(Cc2nc3ccc(cc3s2)C(F)(F)F)c(=O)c2ccccc12
: