Target
Aldo-keto reductase family 1 member B1
Ligand
BDBM16456
Substrate
Meas. Tech.
ChEMBL_457959 (CHEMBL924228)
IC50
150±n/a nM
Citation
 Ferrari, AMDegliesposti, GSgobba, MRastelli, G Validation of an automated procedure for the prediction of relative free energies of binding on a set of aldose reductase inhibitors. Bioorg Med Chem 15:7865-77 (2007)  
Target
Name:
Aldo-keto reductase family 1 member B1
Synonyms:
AKR1B1 ALDR_HUMAN AR Aldose Reductase (ALR2) Aldose reductase (AR)
Type:
Protein
Mol. Mass.:
35855.50
Organism:
Homo sapiens (Human)
Description:
P15121. 4LAU; 2IKI; 4LB4; 2FZD; 2FZ8; 1US0
Residue:
316
  
Inhibitor
Name:
BDBM16456
Synonyms:
6-(1-benzofuran-2-sulfonyl)-2,3-dihydropyridazin-3-one Heterocyclic Sulfonylpyridazinone, 19h | benzofuran, 22
Type:
Small organic molecule
Emp. Form.:
C12H8N2O4S
Mol. Mass.:
276.268
SMILES:
O=c1ccc(n[nH]1)S(=O)(=O)c1cc2ccccc2o1
: