Target
Macrophage colony-stimulating factor 1 receptor
Ligand
BDBM50223670
Substrate
Meas. Tech.
ChEMBL_458218 (CHEMBL925553)
IC50
19±n/a nM
Citation
 Patch, RJBrandt, BMAsgari, DBaindur, NChadha, NKGeorgiadis, TCheung, WSPetrounia, IPDonatelli, RRChaikin, MAPlayer, MR Potent 2'-aminoanilide inhibitors of cFMS as potential anti-inflammatory agents. Bioorg Med Chem Lett 17:6070-4 (2007)  
Target
Name:
Macrophage colony-stimulating factor 1 receptor
Synonyms:
CSF1R FMS Macrophage colony stimulating factor receptor Macrophage colony-stimulating factor 1 receptor (c-FMS) Proto-oncogene c-Fms c-fms | cFMS
Type:
Protein
Mol. Mass.:
107979.48
Organism:
Homo sapiens (Human)
Description:
P07333
Residue:
972
  
Inhibitor
Name:
BDBM50223670
Synonyms:
5-cyano-N-(5-((2,3-dihydroxypropoxy)methyl)-2-(piperidin-1-yl)phenyl)furan-2-carboxamide | CHEMBL398360
Type:
Small organic molecule
Emp. Form.:
C21H25N3O5
Mol. Mass.:
399.4403
SMILES:
OCC(O)COCc1ccc(N2CCCCC2)c(NC(=O)c2ccc(o2)C#N)c1
: