Target
Phenylethanolamine N-methyltransferase
Ligand
BDBM50227513
Substrate
Meas. Tech.
ChEMBL_461583 (CHEMBL927606)
Ki
300000±n/a nM
Citation
 Grunewald, GLSeim, MRBhat, SRWilson, MECriscione, KR Synthesis of 4,5,6,7-tetrahydrothieno[3,2-c]pyridines and comparison with their isosteric 1,2,3,4-tetrahydroisoquinolines as inhibitors of phenylethanolamine N-methyltransferase. Bioorg Med Chem 16:542-59 (2008)  
Target
Name:
Phenylethanolamine N-methyltransferase
Synonyms:
Noradrenaline N-methyltransferase PNMT PNMTase | Phenylethanolamine N-Methyltransferase (PNMT)
Type:
Enzyme
Mol. Mass.:
30852.66
Organism:
Homo sapiens (Human)
Description:
Residue:
282
  
Inhibitor
Name:
BDBM50227513
Synonyms:
2-(thiophen-2-yl)ethanamine | CHEMBL252803
Type:
Small organic molecule
Emp. Form.:
C6H9NS
Mol. Mass.:
127.207
SMILES:
NCCc1cccs1
: