Target
C-X-C chemokine receptor type 3
Ligand
BDBM50227866
Substrate
Meas. Tech.
ChEMBL_461636 (CHEMBL928754)
Ki
6±n/a nM
Citation
 Watson, RJAllen, DRBirch, HLChapman, GAGalvin, FCJopling, LAKnight, RLMeier, DOliver, KMeissner, JWOwen, DAThomas, EJTremayne, NWilliams, SC Development of CXCR3 antagonists. Part 3: Tropenyl and homotropenyl-piperidine urea derivatives. Bioorg Med Chem Lett 18:147-51 (2008)  
Target
Name:
C-X-C chemokine receptor type 3
Synonyms:
CXCR3_MOUSE Cxcr3
Type:
PROTEIN
Mol. Mass.:
41020.84
Organism:
Mus musculus
Description:
ChEMBL_560734
Residue:
367
  
Inhibitor
Name:
BDBM50227866
Synonyms:
1-(8-((9-acetyl-9-aza-bicyclo[3.3.1]non-2-en-3-yl)methyl)-8-aza-bicyclo[3.2.1]octan-3-yl)-3-(3-fluoro-5-(trifluoromethyl)phenyl)urea | CHEMBL252258
Type:
Small organic molecule
Emp. Form.:
C26H32F4N4O2
Mol. Mass.:
508.5515
SMILES:
CC(=O)N1C2CCCC1C=C(CN1C3CCC1CC(C3)NC(=O)Nc1cc(F)cc(c1)C(F)(F)F)C2
: