Target
Inosine-5'-monophosphate dehydrogenase 1
Ligand
BDBM50228085
Substrate
Meas. Tech.
ChEMBL_452397 (CHEMBL902633)
Ki
70±n/a nM
Citation
 Chen, LWilson, DJayaram, HNPankiewicz, KW Dual inhibitors of inosine monophosphate dehydrogenase and histone deacetylases for cancer treatment. J Med Chem 50:6685-91 (2007)  
Target
Name:
Inosine-5'-monophosphate dehydrogenase 1
Synonyms:
IMDH1_HUMAN IMPD 1 IMPDH-I Inosine Monophosphate Dehydrogenase Type 1 (IMPDH1) | Inosine-5'-monophosphate dehydrogenase (IMPDH)
Type:
Enzyme
Mol. Mass.:
55407.70
Organism:
Homo sapiens (Human)
Description:
Recombinant IMPDH1 expressed in E. coli.
Residue:
514
  
Inhibitor
Name:
BDBM50228085
Synonyms:
CHEMBL238461 | N-hydroxy-6-(4-hydroxy-6-methoxy-7-methyl-3-oxo-1,3-dihydroisobenzofuran-5-yl)-4-methylhex-4-enamide
Type:
Small organic molecule
Emp. Form.:
C17H21NO6
Mol. Mass.:
335.3517
SMILES:
COc1c(C)c2COC(=O)c2c(O)c1C\C=C(/C)CCC(=O)NO
: