Target
Macrophage colony-stimulating factor 1 receptor
Ligand
BDBM50233703
Substrate
Meas. Tech.
ChEMBL_462418 (CHEMBL927234)
IC50
720±n/a nM
Citation
 Illig, CRChen, JWall, MJWilson, KJBallentine, SKRudolph, MJDesJarlais, RLChen, YSchubert, CPetrounia, ICrysler, CSMolloy, CJChaikin, MAManthey, CLPlayer, MRTomczuk, BEMeegalla, SK Discovery of novel FMS kinase inhibitors as anti-inflammatory agents. Bioorg Med Chem Lett 18:1642-8 (2008)  
Target
Name:
Macrophage colony-stimulating factor 1 receptor
Synonyms:
CSF1R FMS Macrophage colony stimulating factor receptor Macrophage colony-stimulating factor 1 receptor (c-FMS) Proto-oncogene c-Fms c-fms | cFMS
Type:
Protein
Mol. Mass.:
107979.48
Organism:
Homo sapiens (Human)
Description:
P07333
Residue:
972
  
Inhibitor
Name:
BDBM50233703
Synonyms:
5-cyano-N-(5-(4-methylpiperazin-1-yl)-3-(4-methylpiperidin-1-yl)pyridin-2-yl)furan-2-carboxamide | CHEMBL251842
Type:
Small organic molecule
Emp. Form.:
C22H28N6O2
Mol. Mass.:
408.4967
SMILES:
CC1CCN(CC1)c1cc(cnc1NC(=O)c1ccc(o1)C#N)N1CCN(C)CC1
: