Target
Macrophage colony-stimulating factor 1 receptor
Ligand
BDBM50233709
Substrate
Meas. Tech.
ChEMBL_462418 (CHEMBL927234)
IC50
3±n/a nM
Citation
 Illig, CRChen, JWall, MJWilson, KJBallentine, SKRudolph, MJDesJarlais, RLChen, YSchubert, CPetrounia, ICrysler, CSMolloy, CJChaikin, MAManthey, CLPlayer, MRTomczuk, BEMeegalla, SK Discovery of novel FMS kinase inhibitors as anti-inflammatory agents. Bioorg Med Chem Lett 18:1642-8 (2008)  
Target
Name:
Macrophage colony-stimulating factor 1 receptor
Synonyms:
CSF1R FMS Macrophage colony stimulating factor receptor Macrophage colony-stimulating factor 1 receptor (c-FMS) Proto-oncogene c-Fms c-fms | cFMS
Type:
Protein
Mol. Mass.:
107979.48
Organism:
Homo sapiens (Human)
Description:
P07333
Residue:
972
  
Inhibitor
Name:
BDBM50233709
Synonyms:
CHEMBL253027 | N-(4-(1H-imidazol-1-yl)-2-(piperidin-1-yl)phenyl)-5-cyanofuran-2-carboxamide
Type:
Small organic molecule
Emp. Form.:
C20H19N5O2
Mol. Mass.:
361.3972
SMILES:
O=C(Nc1ccc(cc1N1CCCCC1)-n1ccnc1)c1ccc(o1)C#N
: