Target
Macrophage colony-stimulating factor 1 receptor
Ligand
BDBM50233712
Substrate
Meas. Tech.
ChEMBL_462418 (CHEMBL927234)
IC50
71±n/a nM
Citation
 Illig, CRChen, JWall, MJWilson, KJBallentine, SKRudolph, MJDesJarlais, RLChen, YSchubert, CPetrounia, ICrysler, CSMolloy, CJChaikin, MAManthey, CLPlayer, MRTomczuk, BEMeegalla, SK Discovery of novel FMS kinase inhibitors as anti-inflammatory agents. Bioorg Med Chem Lett 18:1642-8 (2008)  
Target
Name:
Macrophage colony-stimulating factor 1 receptor
Synonyms:
CSF1R FMS Macrophage colony stimulating factor receptor Macrophage colony-stimulating factor 1 receptor (c-FMS) Proto-oncogene c-Fms c-fms | cFMS
Type:
Protein
Mol. Mass.:
107979.48
Organism:
Homo sapiens (Human)
Description:
P07333
Residue:
972
  
Inhibitor
Name:
BDBM50233712
Synonyms:
5-cyano-N-(4-(methylsulfonamido)-2-(piperidin-1-yl)phenyl)furan-2-carboxamide | CHEMBL428945
Type:
Small organic molecule
Emp. Form.:
C18H20N4O4S
Mol. Mass.:
388.441
SMILES:
CS(=O)(=O)Nc1ccc(NC(=O)c2ccc(o2)C#N)c(c1)N1CCCCC1
: