Target
Angiotensin-converting enzyme 2
Ligand
BDBM50233798
Substrate
Meas. Tech.
ChEMBL_462458 (CHEMBL928323)
IC50
57000±n/a nM
Citation
 Deaton, DNGraham, KPGross, JWMiller, AB Thiol-based angiotensin-converting enzyme 2 inhibitors: P1' modifications for the exploration of the S1' subsite. Bioorg Med Chem Lett 18:1681-7 (2008)  
Target
Name:
Angiotensin-converting enzyme 2
Synonyms:
ACE-related carboxypeptidase ACE2_HUMAN Angiotensin-converting enzyme homolog Metalloprotease MPROT15
Type:
Enzyme
Mol. Mass.:
92448.86
Organism:
Homo sapiens (Human)
Description:
Residue:
805
  
Inhibitor
Name:
BDBM50233798
Synonyms:
CHEMBL398940 med.21724, Compound 7
Type:
Small organic molecule
Emp. Form.:
C6H15N3
Mol. Mass.:
129.2034
SMILES:
NCCNCCN1CC1
: