Target
Epidermal growth factor receptor
Ligand
BDBM50236369
Substrate
Meas. Tech.
ChEMBL_462993 (CHEMBL928914)
IC50
366±n/a nM
Citation
 Barlaam, BActon, DGBallard, PBradbury, RHCross, DDucray, RGermain, HHudson, KKlinowska, TMagnien, FOgilvie, DJOlivier, ARoss, HSSmith, RTrigwell, CBVautier, MWright, L Neutral 5-substituted 4-indazolylaminoquinazolines as potent, orally active inhibitors of erbB2 receptor tyrosine kinase. Bioorg Med Chem Lett 18:1799-803 (2008)  
Target
Name:
Epidermal growth factor receptor
Synonyms:
EGF Receptor Substrate EGFR_HUMAN ERBB1 Epidermal Growth Factor Receptor erbB-1 Epidermal growth factor receptor (EGFR) HER1 Proto-oncogene c-ErbB-1 Tyrosine-Protein Kinase ErbB-1
Type:
Receptor Kinase Domain
Mol. Mass.:
134279.59
Organism:
Homo sapiens (Human)
Description:
P00533
Residue:
1210
  
Inhibitor
Name:
BDBM50236369
Synonyms:
(R)-1-morpholino-2-(4-(1-(thiazol-2-ylmethyl)-1H-indazol-5-ylamino)quinazolin-5-yloxy)propan-1-one | CHEMBL257411
Type:
Small organic molecule
Emp. Form.:
C26H25N7O3S
Mol. Mass.:
515.587
SMILES:
C[C@@H](Oc1cccc2ncnc(Nc3ccc4n(Cc5nccs5)ncc4c3)c12)C(=O)N1CCOCC1
: