Target
Adenosine receptor A2a
Ligand
BDBM50237080
Substrate
Meas. Tech.
ChEMBL_463076 (CHEMBL928986)
Ki
36±n/a nM
Citation
 Zhang, XRueter, JKChen, YMoorjani, MLanier, MCLin, EGross, RSTellew, JEWilliams, JPLechner, SMMarkison, SJoswig, TMalany, SSantos, MCastro-Palomino, JCCrespo, MIPrat, MGual, SDíaz, JLSaunders, JSlee, DH Synthesis of N-pyrimidinyl-2-phenoxyacetamides as adenosine A2A receptor antagonists. Bioorg Med Chem Lett 18:1778-83 (2008)  
Target
Name:
Adenosine receptor A2a
Synonyms:
A2A adenosine receptor (hA2A) ADENOSINE A2 ADORA2 Adenosine A2A receptor (A2AAR)
Type:
G Protein-Coupled Receptor (GPCR)
Mol. Mass.:
44716.46
Organism:
Homo sapiens (Human)
Description:
P29274
Residue:
412
  
Inhibitor
Name:
BDBM50237080
Synonyms:
CHEMBL404744 | N-(2-(5-methylfuran-2-yl)-6-(thiazol-2-yl)pyrimidin-4-yl)-2-(p-tolyloxy)acetamide
Type:
Small organic molecule
Emp. Form.:
C21H18N4O3S
Mol. Mass.:
406.458
SMILES:
Cc1ccc(o1)-c1nc(NC(=O)COc2ccc(C)cc2)cc(n1)-c1nccs1
: